{"text_format":"1","workbook":"xlsx","n_sheets":7,"sheets":["datos","ganancia","drawdown","peorcap","perdidas","ruina","Instrucciones"],"not_rendered":{"charts":6,"images":0,"macros":1,"external_links":0,"defined_names":0,"comments":0,"pivot_tables":0},"unopened":[],"bounds":{"document_bytes":16777216,"sheet_cells":100000,"rows_first":2000,"rows_last":500,"rows_between":2000,"halvings":0,"cell_chars":16384,"cell_head_chars":4096},"cells_cut":0,"cells_raw":0,"read":"whole","date_system":"1900"}

{"sheet":"datos","index":0,"n_rows":1599,"n_cols":14,"rows_kept":1599,"cut":false,"hidden":false,"merged":[]}
[-2475,"ALEATORIO",{"$f":"$N$5","v":100000},0,0,null,"Net","MaxDD","PEOR CAP","MCL","RUINA",null,"Rellenar lo que tenga el fondo azul y pulsar \"Calcular\""]
[-1000,{"$f":"INDEX(A:A,RANDBETWEEN(1,$N$8))","v":-12.5},{"$f":"IF(C1>$N$7,C1+B2,C1)","v":99987.5},{"$f":"MAX($C$1:C2)-C2","v":12.5},{"$f":"IF(AND(B2<0,C2>$N$7),E1+1,0)","v":1},null,{"$f":"OFFSET($C$1,$N$9-1,0)-$C$1","v":11904.25},{"$f":"MAX($D$1:OFFSET($D$1,$N$9-1,0))","v":15804.5},{"$f":"MIN($C$1:OFFSET($C$1,$N$9-1,0))","v":88250},{"$f":"MAX($E$1:OFFSET($E$1,$N$9-1,0))","v":8},{"$f":"IF(MIN($C$1:OFFSET($C$1,$N$9-1,0)) < $N$7,1,0)","v":0},null,"Oscar G. Cagigas - 6 Febrero 2020"]
[-700,{"$f":"INDEX(A:A,RANDBETWEEN(1,$N$8))","v":-3000},{"$f":"IF(C2>$N$7,C2+B3,C2)","v":96987.5},{"$f":"MAX($C$1:C3)-C3","v":3012.5},{"$f":"IF(AND(B3<0,C3>$N$7),E2+1,0)","v":2},null,30287.920000000013,11055.779999999999,92157.5,8,0]
[-1350,1610,98597.5,{"$f":"MAX($C$1:C4)-C4","v":1402.5},0,null,14383.75,13007.5,91900,5,0]
[1520,1580,100177.5,{"$f":"MAX($C$1:C5)-C5","v":0},0,null,41482.300000000017,10547.799999999988,95427.5,6,0,null,"Capital inicial",100000]
[-2411.98,1487.5,101665,{"$f":"MAX($C$1:C6)-C6","v":0},0,null,-8037.6999999999971,24190.199999999997,91322.3,8,0,null,"Histor (años)",26]
[-1750,-1112.5,100552.5,{"$f":"MAX($C$1:C7)-C7","v":1112.5},1,null,34026.630000000005,18085.550000000003,95665,12,0,null,"RUINA",70000]
[230,-1662.5,98890,{"$f":"MAX($C$1:C8)-C8","v":2775},2,null,24842.990000000005,6466.8000000000029,98720,4,0,null,"Operaciones",{"$f":"COUNT(A:A)","v":1599}]
[-1420,-1270,97620,{"$f":"MAX($C$1:C9)-C9","v":4045},3,null,38017.820000000007,15703.799999999988,100000,6,0,null,"Ops por año",{"$f":"ROUND($N$8/$N$6,0)","v":62}]
[-1180,1550,99170,{"$f":"MAX($C$1:C10)-C10","v":2495},0,null,36008.700000000012,14085,100000,4,0]
[-1912.5,-900,98270,{"$f":"MAX($C$1:C11)-C11","v":3395},1,null,6652.1999999999971,29362.800000000003,88555.9,6,0]
[1520,-2212.5,96057.5,{"$f":"MAX($C$1:C12)-C12","v":5607.5},2,null,21077.5,16575,90905,8,0]
[-1030,1640,97697.5,{"$f":"MAX($C$1:C13)-C13","v":3967.5},0,null,54338.879999999976,8277.5,95152.5,9,0]
[-2410,-80,97617.5,{"$f":"MAX($C$1:C14)-C14","v":4047.5},1,null,69955.210000000021,11771.5,98270,4,0]
[1520,-1180,96437.5,{"$f":"MAX($C$1:C15)-C15","v":5227.5},2,null,3323.25,25721.75,74278.25,6,0]
[1805.99,-2262.5,94175,{"$f":"MAX($C$1:C16)-C16","v":7490},3,null,31711.819999999978,18683.23000000001,98587.5,5,0]
[50,-4100,90075,{"$f":"MAX($C$1:C17)-C17","v":11590},4,null,69766,6015,98700,4,0]
[-1180,-1825,88250,{"$f":"MAX($C$1:C18)-C18","v":13415},5,null,53557.5,6182.5,96430,6,0]
[-1725,1050,89300,{"$f":"MAX($C$1:C19)-C19","v":12365},0,null,20336.5,11177.5,100000,7,0]
[-1900,4040,93340,{"$f":"MAX($C$1:C20)-C20","v":8325},0,null,3218.3499999999913,16851.520000000004,91401.2,9,0]
[3380,-720,92620,{"$f":"MAX($C$1:C21)-C21","v":9045},1,null,43114.270000000019,7732.5,92842.5,3,0]
[-700,-550,92070,{"$f":"MAX($C$1:C22)-C22","v":9595},2,null,53878.799999999988,6802.5,95087.5,4,0]
[360,7062.5,99132.5,{"$f":"MAX($C$1:C23)-C23","v":2532.5},0,null,9816,11534.399999999994,88465.600000000006,5,0]
[7850,-1025,98107.5,{"$f":"MAX($C$1:C24)-C24","v":3557.5},1,null,5153.3000000000175,35661.699999999983,90685,8,0]
[-720,3550,101657.5,{"$f":"MAX($C$1:C25)-C25","v":7.5},0,null,7661.0299999999988,26684,73316,5,0]
[820,14625,116282.5,{"$f":"MAX($C$1:C26)-C26","v":0},0,null,36535.979999999981,7370,93410,5,0]
[-1690,1700,117982.5,{"$f":"MAX($C$1:C27)-C27","v":0},0,null,-13672.5,26036.199999999997,76933.8,8,0]
[600,862.5,118845,{"$f":"MAX($C$1:C28)-C28","v":0},0,null,-31590.570000000007,31590.570000000007,68409.429999999993,13,1]
[-2240,1150,119995,{"$f":"MAX($C$1:C29)-C29","v":0},0,null,8844.39,12143.009999999995,90586.99,5,0]
[4430,-1560,118435,{"$f":"MAX($C$1:C30)-C30","v":1560},1,null,72893.25,7000,100000,4,0]
[-610,-1430,117005,{"$f":"MAX($C$1:C31)-C31","v":2990},2,null,65204.28,11497.5,91432.5,6,0]
[-740,-1700,115305,{"$f":"MAX($C$1:C32)-C32","v":4690},3,null,1078.179999999993,18138.020000000004,87343.18,6,0]
[-840,-2200,113105,{"$f":"MAX($C$1:C33)-C33","v":6890},4,null,51397.600000000006,15188.699999999997,84811.3,4,0]
[710,830,113935,{"$f":"MAX($C$1:C34)-C34","v":6060},0,null,39164.570000000007,8006.2000000000116,99542.5,4,0]
[5060,-4987.5,108947.5,{"$f":"MAX($C$1:C35)-C35","v":11047.5},1,null,5785.2599999999948,14209.520000000004,85790.48,6,0]
[-1960,-820,108127.5,{"$f":"MAX($C$1:C36)-C36","v":11867.5},2,null,48579.919999999984,11293.900000000009,94877.5,5,0]
[-750,1470,109597.5,{"$f":"MAX($C$1:C37)-C37","v":10397.5},0,null,-6664.3600000000006,24585.100000000006,90102.14,9,0]
[900,3540,113137.5,{"$f":"MAX($C$1:C38)-C38","v":6857.5},0,null,24835.709999999992,10792.600000000006,100000,7,0]
[20,88,113225.5,{"$f":"MAX($C$1:C39)-C39","v":6769.5},0,null,38569.020000000019,10836.979999999996,90043.7,7,0]
[-1163,-340,112885.5,{"$f":"MAX($C$1:C40)-C40","v":7109.5},1,null,62465.040000000008,7956.9799999999959,99275,6,0]
[1540,460,113345.5,{"$f":"MAX($C$1:C41)-C41","v":6649.5},0,null,34693.179999999993,15386.820000000007,98915,8,0]
[-900,-1360,111985.5,{"$f":"MAX($C$1:C42)-C42","v":8009.5},1,null,-11097.220000000001,28482.800000000003,78377.3,6,0]
[3720,700,112685.5,{"$f":"MAX($C$1:C43)-C43","v":7309.5},0,null,-3037.1000000000058,22212.800000000003,78764.7,8,0]
[1300,1420,114105.5,{"$f":"MAX($C$1:C44)-C44","v":5889.5},0,null,3808.5,14325,97185,6,0]
[230,-1650,112455.5,{"$f":"MAX($C$1:C45)-C45","v":7539.5},1,null,1623.0000000000146,31882.699999999997,100000,9,0]
[-1700,1700,114155.5,{"$f":"MAX($C$1:C46)-C46","v":5839.5},0,null,26645.990000000005,14568.75,91302.49,7,0]
[-850,-970,113185.5,{"$f":"MAX($C$1:C47)-C47","v":6809.5},1,null,105153.08000000002,6606.1999999999971,96640,6,0]
[2780,-3500,109685.5,{"$f":"MAX($C$1:C48)-C48","v":10309.5},2,null,62602.400000000023,11942.5,98900,5,0]
[1500,-340,109345.5,{"$f":"MAX($C$1:C49)-C49","v":10649.5},3,null,28392.069999999992,11652.979999999996,93136.3,6,0]
[-1150,-175,109170.5,{"$f":"MAX($C$1:C50)-C50","v":10824.5},4,null,39342.5,17127.5,100000,6,0]
[1100,-170,109000.5,{"$f":"MAX($C$1:C51)-C51","v":10994.5},5,null,23178.28,15227.5,86705,6,0]
[-1480,-1900,107100.5,{"$f":"MAX($C$1:C52)-C52","v":12894.5},6,null,56943.5,7859.9000000000233,96625,3,0]
[6230,-1510,105590.5,{"$f":"MAX($C$1:C53)-C53","v":14404.5},7,null,33307.580000000016,12633.300000000003,91087.5,11,0]
[-1662,-1400,104190.5,{"$f":"MAX($C$1:C54)-C54","v":15804.5},8,null,41754.150000000023,10250,97575,6,0]
[-1060,500,104690.5,{"$f":"MAX($C$1:C55)-C55","v":15304.5},0,null,11277.550000000003,10973.699999999997,94168.8,6,0]
[1050,-260,104430.5,{"$f":"MAX($C$1:C56)-C56","v":15564.5},1,null,51809.350000000006,13991.75,91208.25,5,0]
[-976,1520,105950.5,{"$f":"MAX($C$1:C57)-C57","v":14044.5},0,null,20833.679999999993,9625,100000,4,0]
[-1690,-225,105725.5,{"$f":"MAX($C$1:C58)-C58","v":14269.5},1,null,-774.75,24689.270000000004,87045.25,11,0]
[-100,3620,109345.5,{"$f":"MAX($C$1:C59)-C59","v":10649.5},0,null,38178.5,14220,96737.5,6,0]
[-3164,1130,110475.5,{"$f":"MAX($C$1:C60)-C60","v":9519.5},0,null,-4641.390000000014,38749.69,95358.609999999986,7,0]
{"$rows_left_out":1540}
{"sheet":"ganancia","index":1,"n_rows":500,"n_cols":13,"rows_kept":500,"cut":false,"hidden":false,"merged":[]}
[{"$f":"C1/500","v":2E-3},-33576.5,1]
[{"$f":"C2/500","v":4.0000000000000001E-3},-33475.75,2]
[6.0000000000000001E-3,-31821.25,3]
[8.0000000000000002E-3,-31590.570000000007,4]
[0.01,-31256.199999999997,5]
[1.2E-2,-31099.520000000004,6]
[1.4E-2,-30251.800000000003,7]
[1.6E-2,-30137.449999999997,8]
[1.7999999999999999E-2,-30129.600000000006,9]
[0.02,-30067.399999999994,10]
[2.1999999999999999E-2,-27843.33,11]
[2.4E-2,-26020.199999999997,12]
[2.5999999999999999E-2,-25201.899999999994,13]
[2.8000000000000001E-2,-25047.380000000005,14]
[0.03,-23830.289999999994,15]
[3.2000000000000001E-2,-23309.959999999992,16]
[3.4000000000000002E-2,-20860.809999999998,17]
[3.5999999999999997E-2,-17711.179999999993,18]
[3.7999999999999999E-2,-17194.259999999995,19]
[0.04,-17000,20]
[4.2000000000000003E-2,-16602.929999999993,21]
[4.3999999999999997E-2,-16070.199999999997,22]
[4.5999999999999999E-2,-15963.699999999997,23]
[4.8000000000000001E-2,-15957.199999999997,24,null,"Percentil","Valor",null,"La ganancia media es de ",null,{"$f":"F25","v":26275.700000000012},"dólares"]
[0.05,-14367.009999999995,25,null,0.5,{"$f":"VLOOKUP(E25,$A$1:$B$500,2,TRUE)","v":26275.700000000012},null,"Con un 95% de confianza la ganancia será mayor de",null,null,null,{"$f":"F26","v":-14367.009999999995},"dólares"]
[5.1999999999999998E-2,-14019.86,26,null,0.05,{"$f":"VLOOKUP(E26,$A$1:$B$500,2,TRUE)","v":-14367.009999999995},null,"Con un 95% de confianza la ganancia será menos de",null,null,null,{"$f":"F27","v":70271.31},"dólares"]
[5.3999999999999999E-2,-13947.349999999991,27,null,0.95,{"$f":"VLOOKUP(E27,$A$1:$B$500,2,TRUE)","v":70271.31},null,"La probabilidad de ganar ",null,{"$f":"datos!$N$5","v":100000},"es del ",{"$f":"1-OFFSET($A$1,VLOOKUP($J$27,$B$1:$C$500,2,TRUE),0)","v":1.0000000000000009E-2}]
[5.6000000000000001E-2,-13672.5,28,null,null,null,null,"La probabilidad de ganar ",null,{"$f":"datos!$N$5/2","v":50000},"es del ",{"$f":"1-OFFSET($A$1,VLOOKUP($J$28,$B$1:$C$500,2,TRUE),0)","v":0.18000000000000005}]
[5.8000000000000003E-2,-12953.699999999997,29,null,null,null,null,"La probabilidad de terminar el año en pérdidas es del ",null,null,null,{"$f":"OFFSET($A$1,VLOOKUP(0,$B$1:$C$500,2,TRUE),0)","v":0.158}]
[0.06,-11993.600000000006,30]
[6.2E-2,-11929.979999999996,31]
[6.4000000000000001E-2,-11708.400000000009,32]
[6.6000000000000003E-2,-11418.229999999996,33]
[6.8000000000000005E-2,-11097.220000000001,34]
[7.0000000000000007E-2,-10409.050000000003,35]
[7.1999999999999995E-2,-10328.12999999999,36]
[7.3999999999999996E-2,-9672.6500000000087,37]
[7.5999999999999998E-2,-9549.0100000000093,38]
[7.8E-2,-9048.7799999999988,39]
[0.08,-9007.6999999999971,40]
[8.2000000000000003E-2,-8724.75,41]
[8.4000000000000005E-2,-8452.070000000007,42]
[8.5999999999999993E-2,-8430.0500000000029,43]
[8.7999999999999995E-2,-8237.339999999982,44]
[0.09,-8154.3000000000029,45]
[9.1999999999999998E-2,-8037.6999999999971,46]
[9.4E-2,-7629.8999999999942,47]
[9.6000000000000002E-2,-7616.1000000000058,48]
[9.8000000000000004E-2,-7352.3999999999942,49]
[0.1,-6946.570000000007,50]
[0.10199999999999999,-6919.179999999993,51]
[0.104,-6817.859999999986,52]
[0.106,-6816.6599999999889,53]
[0.108,-6664.3600000000006,54]
[0.11,-6623.3999999999942,55]
[0.112,-6547.3000000000029,56]
[0.114,-6299.5500000000029,57]
[0.11600000000000001,-6274.4899999999907,58]
[0.11799999999999999,-6157.8400000000111,59]
[0.12,-5737.3999999999942,60]
{"$rows_left_out":441}
{"sheet":"drawdown","index":2,"n_rows":500,"n_cols":13,"rows_kept":500,"cut":false,"hidden":false,"merged":[]}
[{"$f":"C1/500","v":2E-3},3937.5,1]
[{"$f":"C2/500","v":4.0000000000000001E-3},4316.2000000000116,2]
[6.0000000000000001E-3,5470,3]
[8.0000000000000002E-3,5862.5,4]
[0.01,5924.9000000000087,5]
[1.2E-2,5926.3000000000029,6]
[1.4E-2,5930.1000000000058,7]
[1.6E-2,6015,8]
[1.7999999999999999E-2,6082.5,9]
[0.02,6130.5,10]
[2.1999999999999999E-2,6182.5,11]
[2.4E-2,6211.9799999999959,12]
[2.5999999999999999E-2,6335,13]
[2.8000000000000001E-2,6390,14]
[0.03,6466.8000000000029,15]
[3.2000000000000001E-2,6470,16]
[3.4000000000000002E-2,6606.1999999999971,17]
[3.5999999999999997E-2,6651.5,18]
[3.7999999999999999E-2,6802.5,19]
[0.04,7000,20]
[4.2000000000000003E-2,7022,21]
[4.3999999999999997E-2,7032.5999999999767,22]
[4.5999999999999999E-2,7092.5,23]
[4.8000000000000001E-2,7214.9800000000105,24,null,"Percentil","Valor",null,"El drawdown medio es de ",null,{"$f":"F25","v":13594.200000000012},"dólares"]
[0.05,7225,25,null,0.5,{"$f":"VLOOKUP(E25,$A$1:$B$500,2,TRUE)","v":13594.200000000012},null,"Con un 95% de confianza el drawdown será mayor de",null,null,null,{"$f":"F26","v":7225},"dólares"]
[5.1999999999999998E-2,7370,26,null,0.05,{"$f":"VLOOKUP(E26,$A$1:$B$500,2,TRUE)","v":7225},null,"Con un 95% de confianza el drawdown será menos de",null,null,null,{"$f":"F27","v":29969.75},"dólares"]
[5.3999999999999999E-2,7397.5,27,null,0.95,{"$f":"VLOOKUP(E27,$A$1:$B$500,2,TRUE)","v":29969.75},null,"La probabilidad de un drawdown de 30.000 dólares o más es del ",null,null,null,null,{"$f":"1-OFFSET(A1,VLOOKUP(30000,$B$1:$C$500,2,TRUE),0)","v":4.8000000000000043E-2}]
[5.6000000000000001E-2,7409.3500000000058,28,null,null,null,null,"La probabilidad de un drawdown de 40.000 dólares o más es del ",null,null,null,null,{"$f":"1-OFFSET(A1,VLOOKUP(40000,$B$1:$C$500,2,TRUE),0)","v":1}]
[5.8000000000000003E-2,7480,29]
[0.06,7561.1999999999971,30]
[6.2E-2,7656.1999999999971,31]
[6.4000000000000001E-2,7656.2999999999884,32]
[6.6000000000000003E-2,7732.5,33]
[6.8000000000000005E-2,7777.5,34]
[7.0000000000000007E-2,7859.9000000000233,35]
[7.1999999999999995E-2,7900,36]
[7.3999999999999996E-2,7915.6999999999971,37]
[7.5999999999999998E-2,7925.1000000000058,38]
[7.8E-2,7931.25,39]
[0.08,7935,40]
[8.2000000000000003E-2,7956.9799999999959,41]
[8.4000000000000005E-2,7958.2799999999988,42]
[8.5999999999999993E-2,7972.5,43]
[8.7999999999999995E-2,8006.2000000000116,44]
[0.09,8016.1999999999971,45]
[9.1999999999999998E-2,8060,46]
[9.4E-2,8079.0099999999948,47]
[9.6000000000000002E-2,8088.7999999999884,48]
[9.8000000000000004E-2,8100,49]
[0.1,8113.7000000000116,50]
[0.10199999999999999,8115.7000000000116,51]
[0.104,8120,52]
[0.106,8170,53]
[0.108,8270,54]
[0.11,8277.5,55]
[0.112,8288.6999999999971,56]
[0.114,8312.5,57]
[0.11600000000000001,8360,58]
[0.11799999999999999,8396.9000000000087,59]
[0.12,8402.5,60]
{"$rows_left_out":441}
{"sheet":"peorcap","index":3,"n_rows":500,"n_cols":14,"rows_kept":500,"cut":false,"hidden":false,"merged":[]}
[{"$f":"C1/500","v":2E-3},66423.5,1]
[{"$f":"C2/500","v":4.0000000000000001E-3},66524.25,2]
[6.0000000000000001E-3,68178.75,3]
[8.0000000000000002E-3,68409.429999999993,4]
[0.01,68743.8,5]
[1.2E-2,68900.479999999996,6]
[1.4E-2,69748.2,7]
[1.6E-2,69862.55,8]
[1.7999999999999999E-2,69870.399999999994,9]
[0.02,69932.600000000006,10]
[2.1999999999999999E-2,70855.520000000004,11]
[2.4E-2,71373.600000000006,12]
[2.5999999999999999E-2,71698.100000000006,13]
[2.8000000000000001E-2,72156.67,14]
[0.03,72858.899999999994,15]
[3.2000000000000001E-2,73316,16]
[3.4000000000000002E-2,73827.55,17]
[3.5999999999999997E-2,73979.8,18]
[3.7999999999999999E-2,73987.55,19]
[0.04,74246.3,20]
[4.2000000000000003E-2,74278.25,21]
[4.3999999999999997E-2,74952.62,22]
[4.5999999999999999E-2,74956.95,23]
[4.8000000000000001E-2,75456.3,24,null,"Percentil","Valor",null,"En promedio el capital caerá como mucho hasta los",null,null,null,{"$f":"F25","v":95350},"dólares"]
[0.05,75649.710000000006,25,null,0.5,{"$f":"VLOOKUP(E25,$A$1:$B$500,2,TRUE)","v":95350},null,"Con un 95% de confianza el capital no caerá por debajo de los",null,null,null,null,{"$f":"F26","v":75649.710000000006},"dólares"]
[5.1999999999999998E-2,75788.75,26,null,0.05,{"$f":"VLOOKUP(E26,$A$1:$B$500,2,TRUE)","v":75649.710000000006},null,"La probabilidad de que el capital caiga por debajo del valor inicial es ",null,null,null,null,{"$f":"OFFSET($A$1,VLOOKUP(datos!$N$5-1,$B$1:$C$500,2,TRUE),0)","v":0.83799999999999997}]
[5.3999999999999999E-2,76058.75,27,null,0.95,{"$f":"VLOOKUP(E27,$A$1:$B$500,2,TRUE)","v":100000},null,"La probabilidad de que el capital caiga 20.000 es del ",null,null,null,null,{"$f":"OFFSET($A$1,VLOOKUP(datos!$N$5-19999,$B$1:$C$500,2,TRUE),0)","v":9.1999999999999998E-2}]
[5.6000000000000001E-2,76225.95,28,null,null,null,null,"La probabilidad de que el capital caiga 40.000 es del ",null,null,null,null,{"$f":"OFFSET($A$1,VLOOKUP(datos!$N$5-39999,$B$1:$C$500,2,TRUE),0)","v":{"$error":"#N/A"}}]
[5.8000000000000003E-2,76370.100000000006,29]
[0.06,76466.2,30]
[6.2E-2,76629.7,31]
[6.4000000000000001E-2,76817.240000000005,32]
[6.6000000000000003E-2,76893.2,33]
[6.8000000000000005E-2,76933.8,34]
[7.0000000000000007E-2,77618.2,35]
[7.1999999999999995E-2,78053.099999999991,36]
[7.3999999999999996E-2,78218.899999999994,37]
[7.5999999999999998E-2,78377.3,38]
[7.8E-2,78608.540000000008,39]
[0.08,78694.429999999993,40]
[8.2000000000000003E-2,78764.7,41]
[8.4000000000000005E-2,79189.510000000009,42]
[8.5999999999999993E-2,79259.570000000007,43]
[8.7999999999999995E-2,79456.320000000007,44]
[0.09,79516,45]
[9.1999999999999998E-2,80189.62000000001,46]
[9.4E-2,80359.099999999991,47]
[9.6000000000000002E-2,80390.48,48]
[9.8000000000000004E-2,80877.08,49]
[0.1,80935.98,50]
[0.10199999999999999,80958.5,51]
[0.104,81357.510000000009,52]
[0.106,81773.900000000009,53]
[0.108,81840.14,54]
[0.11,81858.5,55]
[0.112,82025.75,56]
[0.114,82427.5,57]
[0.11600000000000001,82655.25,58]
[0.11799999999999999,82901.2,59]
[0.12,82903.489999999991,60]
{"$rows_left_out":441}
{"sheet":"perdidas","index":4,"n_rows":500,"n_cols":13,"rows_kept":500,"cut":false,"hidden":false,"merged":[]}
[{"$f":"C1/500","v":2E-3},2,1]
[{"$f":"C2/500","v":4.0000000000000001E-3},2,2]
[6.0000000000000001E-3,3,3]
[8.0000000000000002E-3,3,4]
[0.01,3,5]
[1.2E-2,3,6]
[1.4E-2,3,7]
[1.6E-2,3,8]
[1.7999999999999999E-2,3,9]
[0.02,3,10]
[2.1999999999999999E-2,3,11]
[2.4E-2,3,12]
[2.5999999999999999E-2,3,13]
[2.8000000000000001E-2,3,14]
[0.03,3,15]
[3.2000000000000001E-2,3,16]
[3.4000000000000002E-2,3,17]
[3.5999999999999997E-2,3,18]
[3.7999999999999999E-2,3,19]
[0.04,3,20]
[4.2000000000000003E-2,3,21]
[4.3999999999999997E-2,4,22]
[4.5999999999999999E-2,4,23]
[4.8000000000000001E-2,4,24,null,"Percentil","Valor",null,"En promedio al año habrá",null,{"$f":"F25","v":6},"pérdidas consecutivas"]
[0.05,4,25,null,0.5,{"$f":"VLOOKUP(E25,$A$1:$B$500,2,TRUE)","v":6},null,"Con un 95% de confianza no habrá más de ",null,null,null,{"$f":"F27","v":10},"perdidas seguidas"]
[5.1999999999999998E-2,4,26,null,0.05,{"$f":"VLOOKUP(E26,$A$1:$B$500,2,TRUE)","v":4},null,"Con un 95% de confianza al menos habrá",null,null,null,{"$f":"F26","v":4},"perdidas seguidas"]
[5.3999999999999999E-2,4,27,null,0.95,{"$f":"VLOOKUP(E27,$A$1:$B$500,2,TRUE)","v":10},null,"La probabilidad de tener 10 pérdidas seguidas o más es del ",null,null,null,null,{"$f":"1-OFFSET($A$1,VLOOKUP(9.9,$B$1:$C$500,2,TRUE),0)","v":5.8000000000000052E-2}]
[5.6000000000000001E-2,4,28,null,null,null,null,"La probabilidad de tener 5 pérdidas seguidas o más es del ",null,null,null,null,{"$f":"1-OFFSET($A$1,VLOOKUP(4.9,$B$1:$C$500,2,TRUE),0)","v":0.76800000000000002}]
[5.8000000000000003E-2,4,29]
[0.06,4,30]
[6.2E-2,4,31]
[6.4000000000000001E-2,4,32]
[6.6000000000000003E-2,4,33]
[6.8000000000000005E-2,4,34]
[7.0000000000000007E-2,4,35]
[7.1999999999999995E-2,4,36]
[7.3999999999999996E-2,4,37]
[7.5999999999999998E-2,4,38]
[7.8E-2,4,39]
[0.08,4,40]
[8.2000000000000003E-2,4,41]
[8.4000000000000005E-2,4,42]
[8.5999999999999993E-2,4,43]
[8.7999999999999995E-2,4,44]
[0.09,4,45]
[9.1999999999999998E-2,4,46]
[9.4E-2,4,47]
[9.6000000000000002E-2,4,48]
[9.8000000000000004E-2,4,49]
[0.1,4,50]
[0.10199999999999999,4,51]
[0.104,4,52]
[0.106,4,53]
[0.108,4,54]
[0.11,4,55]
[0.112,4,56]
[0.114,4,57]
[0.11600000000000001,4,58]
[0.11799999999999999,4,59]
[0.12,4,60]
{"$rows_left_out":441}
{"sheet":"ruina","index":5,"n_rows":500,"n_cols":11,"rows_kept":500,"cut":false,"hidden":false,"merged":[]}
[{"$f":"C1/500","v":2E-3},0,1]
[{"$f":"C2/500","v":4.0000000000000001E-3},0,2]
[6.0000000000000001E-3,0,3]
[8.0000000000000002E-3,0,4]
[0.01,0,5]
[1.2E-2,0,6]
[1.4E-2,0,7]
[1.6E-2,0,8]
[1.7999999999999999E-2,0,9]
[0.02,0,10]
[2.1999999999999999E-2,0,11]
[2.4E-2,0,12]
[2.5999999999999999E-2,0,13]
[2.8000000000000001E-2,0,14]
[0.03,0,15]
[3.2000000000000001E-2,0,16]
[3.4000000000000002E-2,0,17]
[3.5999999999999997E-2,0,18]
[3.7999999999999999E-2,0,19]
[0.04,0,20]
[4.2000000000000003E-2,0,21]
[4.3999999999999997E-2,0,22]
[4.5999999999999999E-2,0,23]
[4.8000000000000001E-2,0,24,null,"Percentil","Valor"]
[0.05,0,25,null,0.5,{"$f":"VLOOKUP(E25,$A$1:$B$500,2,TRUE)","v":0},null,"La probabilidad de RUINA es del ",null,null,{"$f":"SUM($B$1:$B$500)/500","v":0.02}]
[5.1999999999999998E-2,0,26,null,0.05,{"$f":"VLOOKUP(E26,$A$1:$B$500,2,TRUE)","v":0}]
[5.3999999999999999E-2,0,27,null,0.95,{"$f":"VLOOKUP(E27,$A$1:$B$500,2,TRUE)","v":0}]
[5.6000000000000001E-2,0,28]
[5.8000000000000003E-2,0,29]
[0.06,0,30]
[6.2E-2,0,31]
[6.4000000000000001E-2,0,32]
[6.6000000000000003E-2,0,33]
[6.8000000000000005E-2,0,34]
[7.0000000000000007E-2,0,35]
[7.1999999999999995E-2,0,36]
[7.3999999999999996E-2,0,37]
[7.5999999999999998E-2,0,38]
[7.8E-2,0,39]
[0.08,0,40]
[8.2000000000000003E-2,0,41]
[8.4000000000000005E-2,0,42]
[8.5999999999999993E-2,0,43]
[8.7999999999999995E-2,0,44]
[0.09,0,45]
[9.1999999999999998E-2,0,46]
[9.4E-2,0,47]
[9.6000000000000002E-2,0,48]
[9.8000000000000004E-2,0,49]
[0.1,0,50]
[0.10199999999999999,0,51]
[0.104,0,52]
[0.106,0,53]
[0.108,0,54]
[0.11,0,55]
[0.112,0,56]
[0.114,0,57]
[0.11600000000000001,0,58]
[0.11799999999999999,0,59]
[0.12,0,60]
{"$rows_left_out":441}
{"sheet":"Instrucciones","index":6,"n_rows":9,"n_cols":2,"rows_kept":9,"cut":false,"hidden":false,"merged":[]}
[]
[]
[]
[null,"Esta hoja hace una simulación de Montecarlo a partir de las operaciones de la columna A, hoja \"datos\"."]
[null,"La simulación es para un año de trading."]
[null,"Hay que rellenar en la pestaña \"datos\" lo que tenga fondo azul."]
[null,"El siguiente vídeo en YouTube explica su funcionamiento:"]
[]
[null,"https://youtu.be/REPdDf7_84c"]